Noticias

Se ha publicado un nuevo servicio, el Portal de Juegos Online

Comunidad Game Maker

Bienvenid@ a la comunidad hispana de Game Maker. Nuestro objetivo es crear videojuegos y dar soporte en castellano de GM. Para mejorar nuestro servicio hemos implantado, como adicion al reglamento general, algunas normas especificas en los subforos más comunes. ¡No olvides informarte antes de participar!.

Autor Tema: Necesito ayuda para exportar de GM Studio 2 a Android :(  (Leído 532 veces)

0 Usuarios y 1 Visitante están viendo este tema.

Desconectado xxlucho21xx1

  • Visitante
  • *
  • Puntos: 6
  • Mensajes: 3
    • Ver Perfil
FAILURE: Build failed with an exception.

* What went wrong:
Execution failed for task ':com.timon.pacman:packageRelease'.
> 1 exception was raised by workers:
  java.lang.RuntimeException: java.lang.RuntimeException: com.android.ide.common.signing.KeytoolException: Failed to read key timon from store "C:\Users\user\Documents\GameMakerStudio2\Proyect Pacman Practice\Proyect Pacman Practice gaaaaaaa.keystore": Keystore was tampered with, or password was incorrect


* Try:
Run with --stacktrace option to get the stack trace. Run with --info or --debug option to get more log output. Run with --scan to get full insights.

* Get more help at https://help.gradle.org

Deprecated Gradle features were used in this build, making it incompatible with Gradle 6.0.
Use '--warning-mode all' to show the individual deprecation warnings.
See https://docs.gradle.org/5.1.1/userguide/command_line_interface.html#sec:command_line_warnings

BUILD FAILED in 7s
50 actionable tasks: 6 executed, 44 up-to-date


C:\WINDOWS\system32\cmd.exe DONE (1)
C:\WINDOWS\system32\subst.exe /d W:


C:\WINDOWS\system32\subst.exe DONE (0)
Error : Build Failed
Igor complete.
elapsed time 00:00:13.7557119s for command "C:\ProgramData/GameMakerStudio2/Cache/runtimes\runtime-2.2.5.378/bin/Igor.exe" -j=8 -options="C:\Users\user\AppData\Local\GameMakerStudio2\GMS2TEMP\build.bff" -v -- Android Package started at 10/20/2020 02:40:08
"cmd"  /c subst Z: /d

elapsed time 00:00:00.0689873s for command "cmd" /c subst Z: /d started at 10/20/2020 02:40:21
"cmd"  /c subst Y: /d

elapsed time 00:00:00.0559986s for command "cmd" /c subst Y: /d started at 10/20/2020 02:40:21
"cmd"  /c subst X: /d

elapsed time 00:00:00.0580013s for command "cmd" /c subst X: /d started at 10/20/2020 02:40:22
FAILED: Package Program Complete
For the details of why this build failed, please review the whole log above and also see your Compile Errors window.
« última modificación: Octubre 20, 2020, 09:39:49 am por xxlucho21xx1 »

 


No Tienes Permisos Para Dar Puntos
point 0 Puntos

Este tema no recibió puntos.


Desconectado Clamud

Respuesta #1 en: Octubre 21, 2020, 04:06:29 am
El problema puede estar en la ruta del proyecto, el nombre del proyecto tiene espacios. Prueba guardando el proyecto con otro nombre.

 
Los siguientes usuarios dieron las gracias a este tema: xxlucho21xx1


Desconectado xxlucho21xx1

  • Visitante
  • *
  • Puntos: 6
  • Mensajes: 3
    • Ver Perfil
Respuesta #2 en: Octubre 21, 2020, 06:07:35 pm
Cambio de error AHORA ME SALE ESTO:

FAILURE: Build failed with an exception.

* What went wrong:
Execution failed for task ':com.timon.pacman:packageRelease'.
> 1 exception was raised by workers:
  java.lang.RuntimeException: java.lang.RuntimeException: com.android.ide.common.signing.KeytoolException: Failed to read key timon from store "C:\Users\user\Documents\GameMakerStudio2\Proyect Pacman Practice\Proyect Pacman Practice OR.keystore": Keystore was tampered with, or password was incorrect


* Try:
Run with --stacktrace option to get the stack trace. Run with --info or --debug option to get more log output. Run with --scan to get full insights.

Deprecated Gradle features were used in this build, making it incompatible with Gradle 6.0.

* Get more help at https://help.gradle.org
Use '--warning-mode all' to show the individual deprecation warnings.
See https://docs.gradle.org/5.1.1/userguide/command_line_interface.html#sec:command_line_warnings

BUILD FAILED in 54s
50 actionable tasks: 50 executed


C:\WINDOWS\system32\cmd.exe DONE (1)
C:\WINDOWS\system32\subst.exe /d W:


C:\WINDOWS\system32\subst.exe DONE (0)
Error : Build Failed
Igor complete.

 


Desconectado yokaiworld

Respuesta #3 en: Octubre 23, 2020, 06:34:51 am
 el java del android studio 4 no es compatible con el GMS2 por lo que tendras problemas cuando exportes
https://developer.android.com/studio/archive aqui puedes encotrar el android studio 3,5 ademas el NDK debe ser el 20.0.5594570 has esos cambios a ver si te funciona ami si me sirvieron

https://help.yoyogames.com/hc/en-us/articles/115001368727-Setting-Up-For-Android.
« última modificación: Octubre 23, 2020, 06:36:29 am por yokaiworld »

 
Los siguientes usuarios dieron las gracias a este tema: xxlucho21xx1


Desconectado xxlucho21xx1

  • Visitante
  • *
  • Puntos: 6
  • Mensajes: 3
    • Ver Perfil
Respuesta #4 en: Octubre 23, 2020, 12:38:41 pm
hize los pasos ahora sale otro error <3 :


FAILURE: Build failed with an exception.

* What went wrong:
Execution failed for task ':com.timon.pacman:packageRelease'.
> 1 exception was raised by workers:
  java.lang.RuntimeException: java.lang.RuntimeException: com.android.ide.common.signing.KeytoolException: Failed to read key timon from store "D:\Downloads\PacmanPractice.keystore": Keystore was tampered with, or password was incorrect


* Try:
Run with --stacktrace option to get the stack trace. Run with --info or --debug option to get more log output. Run with --scan to get full insights.

* Get more help at https://help.gradle.org

Deprecated Gradle features were used in this build, making it incompatible with Gradle 6.0.
Use '--warning-mode all' to show the individual deprecation warnings.
See https://docs.gradle.org/5.1.1/userguide/command_line_interface.html#sec:command_line_warnings

BUILD FAILED in 25s
50 actionable tasks: 5 executed, 45 up-to-date


C:\WINDOWS\system32\cmd.exe DONE (1)
C:\WINDOWS\system32\subst.exe /d W:


C:\WINDOWS\system32\subst.exe DONE (0)
Error : Build Failed
Igor complete.

 


Desconectado yokaiworld

Respuesta #5 en: Octubre 25, 2020, 10:03:25 pm
 Keystore was tampered with, or password was incorrect dice que hay algo malo con tu  Keystore

https://help.yoyogames.com/hc/en-us/articles/115001368727-Setting-Up-For-Android
« última modificación: Octubre 25, 2020, 10:05:52 pm por yokaiworld »

 


Desconectado T1ag0

  • Habitual
  • *
  • Puntos: 38
  • Mensajes: 20
    • Ver Perfil
Respuesta #6 en: Noviembre 10, 2020, 09:32:18 pm